BDBM193348 US9199927, 59
SMILES NC(=N)Nc1ccc(cc1)C(=O)Oc1ccc2nc(ccc2c1)C(=O)N(CC(O)=O)Cc1cccc(c1)C(O)=O
InChI Key InChIKey=BWLGESZOIWZYBW-UHFFFAOYSA-N
Data  2 IC50
  Tab Delimited (TSV)   2D SDfile   Computed 3D by Vconf -m prep SDfile
Find this compound or compounds like it in BindingDB:
Activity Spreadsheet -- Enzyme Inhibition Constant Data from BindingDB
Found 2 hits for monomerid = 193348
TargetTrypsinogen 16(Mus musculus (Mouse))
Astellas Pharma
US Patent
LigandPNGBDBM193348(US9199927, 59)
Affinity DataIC50:  0.310nMpH: 8.0 T: 2°C. Assay description: The compound was dissolved in dimethyl sulfoxide (DMSO), and diluted to an arbitrary concentration (A). A was 100-fold diluted with a buffer (0.1 M T...
In DepthDetails US Patent
TargetSerine protease 1(Homo sapiens (Human))
Astellas Pharma
US Patent
LigandPNGBDBM193348(US9199927, 59)
Affinity DataIC50:  0.270nMpH: 8.0 T: 2°C. Assay description: The compound was dissolved in dimethyl sulfoxide (DMSO), and diluted to an arbitrary concentration (A). A was 100-fold diluted with a buffer (0.1 M T...
In DepthDetails US Patent