BDBM193689 2-Hydroxy-N'-{(Z)-[4-(trifluoromethyl)phenyl]methylidene} benzohydrazide (18)
SMILES Oc1ccccc1C(=O)N\N=C/c1ccc(cc1)C(F)(F)F
InChI Key InChIKey=IVPDNRPVBINUSS-OCKHKDLRSA-N
Data  2 IC50
  Tab Delimited (TSV)   2D SDfile   Computed 3D by Vconf -m prep SDfile
Find this compound or compounds like it in BindingDB:
Activity Spreadsheet -- Enzyme Inhibition Constant Data from BindingDB
Found 2 hits for monomerid = 193689
TargetCholinesterase(Homo sapiens (Human))
Hazara University
LigandPNGBDBM193689(2-Hydroxy-N'-{(Z)-[4-(trifluoromethyl)phenyl]m...)
Affinity DataIC50:  2.13E+5nMpH: 7.7Assay Description:Total volume of the reaction mixture was 100 無 containing 60 無, Na2HPO4 buffer, 50 mM and pH 7.7. Ten 無 test compound 0.5 mM well-1 was added foll...
In DepthDetails ArticlePubMed
TargetAcetylcholinesterase(Tetronarce californica (Pacific electric ray) (Tor...)
Hazara University
LigandPNGBDBM193689(2-Hydroxy-N'-{(Z)-[4-(trifluoromethyl)phenyl]m...)
Affinity DataIC50:  4.85E+4nMpH: 7.7Assay Description:Total volume of the reaction mixture was 100 無. It contained 60 無 Na2HPO4 buffer with concentration of 50 mM and pH 7.7. 10 無 test compound (0.5 m...
In DepthDetails ArticlePubMed