BDBM193825 US9670209, Compound 324 1-((R)-3-((1R,3R,5S)-3-(2-ethoxyethyl)-8-azabicyclo[3.2.1]octan-8-yl)-2-methylpropyl)-6-methyl-1H-indazole
SMILES CCOCC[C@@H]1C[C@@H]2CC[C@H](C1)N2C[C@@H](C)Cn1ncc2ccc(C)cc12
InChI Key InChIKey=MBTZPPSXNPETNK-KRXUUXHPSA-N
Data  2 EC50
  Tab Delimited (TSV)   2D SDfile   Computed 3D by Vconf -m prep SDfile
Find this compound or compounds like it in BindingDB:
Activity Spreadsheet -- Enzyme Inhibition Constant Data from BindingDB
Found 2 hits for monomerid = 193825
TargetMuscarinic acetylcholine receptor M2(Homo sapiens (Human))
Acadia Pharmaceuticals
US Patent
LigandPNGBDBM193825(US9670209, Compound 324 1-((R)-3-((1R,3R,5S)-3-(2-...)
Affinity DataEC50:  13nM. Assay description: NIH-3T3 cells were grown in 96-well tissue culture plates to 70% to 80% confluence. Cells were transfected with plasmid DNAs using Superfect Reagent ...
Ligand InfoPC cidPC sid
In DepthDetails US Patent
TargetMuscarinic acetylcholine receptor M1(Homo sapiens (Human))
Acadia Pharmaceuticals
US Patent
LigandPNGBDBM193825(US9670209, Compound 324 1-((R)-3-((1R,3R,5S)-3-(2-...)
Affinity DataEC50:  0.790nM. Assay description: NIH-3T3 cells were grown in 96-well tissue culture plates to 70% to 80% confluence. Cells were transfected with plasmid DNAs using Superfect Reagent ...
Ligand InfoPC cidPC sid
In DepthDetails US Patent