BDBM19466 5,7-dihydroxy-2-(4-hydroxyphenyl)-8-nonyl-3,4-dihydro-2H-1-benzopyran-4-one::8-Alkylnaringenin, 8e
SMILES CCCCCCCCCc1c(O)cc(O)c2C(=O)CC(Oc12)c1ccc(O)cc1
InChI Key InChIKey=PGTXFXPDRFSQPT-UHFFFAOYSA-N
Data  2 IC50
  Tab Delimited (TSV)   2D SDfile   Computed 3D by Vconf -m prep SDfile
Find this compound or compounds like it in BindingDB:
Activity Spreadsheet -- Enzyme Inhibition Constant Data from BindingDB
Found 2 hits for monomerid = 19466
TargetEstrogen receptor beta(Homo sapiens (Human))
Ghent University
LigandPNGBDBM19466(5,7-dihydroxy-2-(4-hydroxyphenyl)-8-nonyl-3,4-dihy...)
Affinity DataIC50:  113nMpH: 7.6 T: 2°C. Assay description: Ligand binding was determined using a scintillation proximity assay with streptavidin-coated polyvinyltoluene scintillation beads (Amersham) and biot...
In DepthDetails ArticlePubMed
TargetEstrogen receptor(Homo sapiens (Human))
Ghent University
LigandPNGBDBM19466(5,7-dihydroxy-2-(4-hydroxyphenyl)-8-nonyl-3,4-dihy...)
Affinity DataIC50:  436nMpH: 7.6 T: 2°C. Assay description: Ligand binding was determined using a scintillation proximity assay with streptavidin-coated polyvinyltoluene scintillation beads (Amersham) and biot...
In DepthDetails ArticlePubMed