BDBM195405 US9670212, 55 3-amino-N-[(8-methyl-2-{4-[(2-methyl-1H-imidazol-1-yl)acetyl]-1,4-diazepan-1-yl}quinolin-3-yl)methyl]pyrazine-2-carboxamide
SMILES Cc1nccn1CC(=O)N1CCCN(CC1)c1nc2c(C)cccc2cc1CNC(=O)c1nccnc1N
InChI Key InChIKey=YEBBWGWMJWUNSY-UHFFFAOYSA-N
Data  1 IC50
  Tab Delimited (TSV)   2D SDfile   Computed 3D by Vconf -m prep SDfile
Find this compound or compounds like it in BindingDB:
Activity Spreadsheet -- Enzyme Inhibition Constant Data from BindingDB
Found 1 hit for monomerid = 195405
LigandPNGBDBM195405(US9670212, 55 3-amino-N-[(8-methyl-2-{4-[(2-methyl...)
Affinity DataIC50:  1.00E+3nM. Assay description: Kinase activity is measured as the percent of ATP consumed following the kinase reaction using luciferase-luciferin-coupled chemiluminescence. Reacti...
Ligand InfoPC cidPC sid
In DepthDetails US Patent