BDBM1955 (Alkylamino)piperidine BHAP Analog 11::1-[(5-Methanesulfonamidoindol-2-yl)carbonyl]-4-[N-methyl-N-[3-[(1-methylcyclopropyl)amino]-2-pyridinyl]amino]piperidine::N-[2-({4-[methyl({3-[(1-methylcyclopropyl)amino]pyridin-2-yl})amino]piperidin-1-yl}carbonyl)-1H-indol-5-yl]methanesulfonamide
SMILES CN(C1CCN(CC1)C(=O)c1cc2cc(NS(C)(=O)=O)ccc2[nH]1)c1ncccc1NC1(C)CC1
InChI Key InChIKey=FCPCXQILQCXUHL-UHFFFAOYSA-N
Data  3 IC50
  Tab Delimited (TSV)   2D SDfile   Computed 3D by Vconf -m prep SDfile
Find this compound or compounds like it in BindingDB:
Activity Spreadsheet -- Enzyme Inhibition Constant Data from BindingDB
Found 3 hits for monomerid = 1955
TargetGag-Pol polyprotein [588-1027]/[588-1147](Human immunodeficiency virus type 1)
Upjohn
LigandPNGBDBM1955((Alkylamino)piperidine BHAP Analog 11 | 1-[(5-Meth...)
Affinity DataIC50:  160nMpH: 8.3 T: 2°C. Assay description: The IC50 of reverse transcriptase is the concentration that inhibits 50% of recombinant HIV-1 RT RNA-directed DNA polymerase activity in vitro.
In DepthDetails ArticlePubMed
TargetGag-Pol polyprotein [588-1127,Y768C]/[588-1147,Y768C](Human immunodeficiency virus type 1)
Upjohn
LigandPNGBDBM1955((Alkylamino)piperidine BHAP Analog 11 | 1-[(5-Meth...)
Affinity DataIC50:  370nM. Assay description: The IC50 of reverse transcriptase is the concentration that inhibits 50% of recombinant HIV-1 RT RNA-directed DNA polymerase activity in vitro.
In DepthDetails ArticlePubMed
TargetGag-Pol polyprotein [588-1027,P823L]/[588-1147,P823L](Human immunodeficiency virus type 1)
Upjohn
LigandPNGBDBM1955((Alkylamino)piperidine BHAP Analog 11 | 1-[(5-Meth...)
Affinity DataIC50:  1.45E+3nM. Assay description: The IC50 of reverse transcriptase is the concentration that inhibits 50% of recombinant HIV-1 RT RNA-directed DNA polymerase activity in vitro.
In DepthDetails ArticlePubMed