BDBM195571 (R)-4'-(2-(2-phenylpiperidine-1-carbonyl)-2H-1,2,3-triazol-4-yl)-[1,1'-biphenyl]-4-carboxylic acid (2)
SMILES OC(=O)c1ccc(cc1)-c1ccc(cc1)-c1cnn(n1)C(=O)N1CCCC[C@@H]1c1ccccc1
InChI Key InChIKey=DMGNPPFKBOMVQC-RUZDIDTESA-N
Data  2 IC50
  Tab Delimited (TSV)   2D SDfile   Computed 3D by Vconf -m prep SDfile
Find this compound or compounds like it in BindingDB:
Activity Spreadsheet -- Enzyme Inhibition Constant Data from BindingDB
Found 2 hits for monomerid = 195571
TargetLiver carboxylesterase 1(Homo sapiens (Human))
Pfizer
LigandPNGBDBM195571((R)-4'-(2-(2-phenylpiperidine-1-carbonyl)-2H-1...)
Affinity DataIC50: <5nMpH: 7.5Assay Description:For determination of IC50 values for CES1 inhibitors, the reactions were carried out in 1.5 mL microcentrifuge tubes in a total reaction volume of 25...
Ligand InfoPC cidPC sid
In DepthDetails ArticlePubMed
TargetLysophospholipase-like protein 1(Homo sapiens (Human))
Pfizer
LigandPNGBDBM195571((R)-4'-(2-(2-phenylpiperidine-1-carbonyl)-2H-1...)
Affinity DataIC50:  59nMpH: 7.5Assay Description:For determination of IC50 values for LYPLAL1 inhibitors, the reactions were carried out in 1.5 mL microcentrifuge tubes in a total reaction volume of...
Ligand InfoPC cidPC sid
In DepthDetails ArticlePubMed