BDBM195706 US9206173, 2468
SMILES COn1c(NC(C)c2ccc(cc2)C(F)(F)F)nc2CCN(Cc2c1=O)C(=O)COc1ccc(cc1)C#N
InChI Key InChIKey=XYQWZNLPGCRSKQ-UHFFFAOYSA-N
Data  1 KI
  Tab Delimited (TSV)   2D SDfile   Computed 3D by Vconf -m prep SDfile
Find this compound or compounds like it in BindingDB:
Activity Spreadsheet -- Enzyme Inhibition Constant Data from BindingDB
Found 1 hit for monomerid = 195706
TargetProlactin-releasing peptide receptor(Homo sapiens (Human))
Otsuka Pharmaceutical
US Patent
LigandPNGBDBM195706(US9206173, 2468)
Affinity DataKi:  6nM ΔG°:  -11.2kcal/molepH: 7.4 T: 2°C. Assay description: Receptor-expressing HEK 293 cell membrane fraction was analyzed by modifying the methods of C. J. Langmead et al. (see Langmead C J, Szekeres P G; Ch...
Ligand InfoPC cidPC sid
In DepthDetails US Patent