BDBM195738 US9670212, 126 1,1-dimethylethyl{1-[3-({[(3-aminopyrazin-2-yl)carbonyl]amino}methyl)-8-methylquinolin-2-yl]piperidin-4-yl}methylcarbamate
SMILES CN(C1CCN(CC1)c1nc2c(C)cccc2cc1CNC(=O)c1nccnc1N)C(=O)OC(C)(C)C
InChI Key InChIKey=VTMLXIXZPSZIFG-UHFFFAOYSA-N
Data  1 IC50
  Tab Delimited (TSV)   2D SDfile   Computed 3D by Vconf -m prep SDfile
Find this compound or compounds like it in BindingDB:
Activity Spreadsheet -- Enzyme Inhibition Constant Data from BindingDB
Found 1 hit for monomerid = 195738
LigandPNGBDBM195738(US9670212, 126 1,1-dimethylethyl{1-[3-({[(3-aminop...)
Affinity DataIC50:  1.00E+3nM. Assay description: Kinase activity is measured as the percent of ATP consumed following the kinase reaction using luciferase-luciferin-coupled chemiluminescence. Reacti...
Ligand InfoPC cidPC sid
In DepthDetails US Patent