BDBM196153 US9211296, Table 6, 7
SMILES Cc1c(cccc1C(O)=O)\N=C\c1cc(Br)cc(Br)c1Br
InChI Key InChIKey=YLXZJVOFGHBDGO-FBCYGCLPSA-N
Data  1 IC50
  Tab Delimited (TSV)   2D SDfile   Computed 3D by Vconf -m prep SDfile
Find this compound or compounds like it in BindingDB:
Activity Spreadsheet -- Enzyme Inhibition Constant Data from BindingDB
Found 1 hit for monomerid = 196153
TargetDNA polymerase(Vaccinia virus (strain WR))
University Of Pennsylvania
US Patent
LigandPNGBDBM196153(US9211296, Table 6, 7)
Affinity DataIC50:  2.60E+4nMpH: 7.4 T: 2°C. Assay description: A rapid plate DNA synthesis assay was performed using optimized conditions. Briefly, a 1.2:1 ratio of a 20-mer oligonucleotide primer (5′-GCGAA...
Ligand InfoPC cidPC sid
In DepthDetails US Patent