BDBM196517 US9212165, 37
SMILES Cc1cccc(n1)C#C[C@]12CC[C@](C1)(CCC2)NC(=O)c1ccccn1
InChI Key InChIKey=DEXYLUUYCMWEGD-YADHBBJMSA-N
Data  1 IC50
  Tab Delimited (TSV)   2D SDfile   Computed 3D by Vconf -m prep SDfile
Find this compound or compounds like it in BindingDB:
Activity Spreadsheet -- Enzyme Inhibition Constant Data from BindingDB
Found 1 hit for monomerid = 196517
TargetMetabotropic glutamate receptor 5(Homo sapiens (Human))
H. Lundbeck
US Patent
LigandPNGBDBM196517(US9212165, 37)
Affinity DataIC50:  5.30nMpH: 7.4Assay Description:The rmGluR5 or hmGluR5 was stably expressed in a HEK 293 cell line and gown in Dulbecco's Modified Eagle Medium (DMEM) (Invitrogen, Carlsbad, Cal...
Ligand InfoPC cidPC sid
In DepthDetails US Patent