BDBM196611 US9670214, TABLE 16.60
SMILES Cc1c(Nc2ccc(OC(F)(F)F)cc2)ncnc1-c1cccc2[nH]ccc12
InChI Key InChIKey=JOHGCEMGLYONCE-UHFFFAOYSA-N
Data  2 IC50
  Tab Delimited (TSV)   2D SDfile   Computed 3D by Vconf -m prep SDfile
Find this compound or compounds like it in BindingDB:
Activity Spreadsheet -- Enzyme Inhibition Constant Data from BindingDB
Found 2 hits for monomerid = 196611
TargetNon-specific protein-tyrosine kinase [T818I](Homo sapiens (Human))
Dana-Farber Cancer Institute
US Patent
LigandPNGBDBM196611(US9670214, TABLE 16.60)
Affinity DataIC50: >1.00E+4nMpH: 7.5Assay Description:In vitro kinase assays were carried out by using recombinant murine c-abl containing SH3, SH2 and kinase domains (residues 46-531) and full length im...
Ligand InfoPC cidPC sid
In DepthDetails US Patent
TargetNon-specific protein-tyrosine kinase(Homo sapiens (Human))
Dana-Farber Cancer Institute
US Patent
LigandPNGBDBM196611(US9670214, TABLE 16.60)
Affinity DataIC50: >1.00E+4nMpH: 7.5Assay Description:In vitro kinase assays were carried out by using recombinant murine c-abl containing SH3, SH2 and kinase domains (residues 46-531) and full length im...
Ligand InfoPC cidPC sid
In DepthDetails US Patent