BDBM196660 US10202399, Example 20::US9212147, 20
SMILES Cc1cccc(CCc2cc(O)c(=O)[nH]n2)c1
InChI Key InChIKey=CGJFENTXONCNNT-UHFFFAOYSA-N
Data  3 IC50
  Tab Delimited (TSV)   2D SDfile   Computed 3D by Vconf -m prep SDfile
Find this compound or compounds like it in BindingDB:
Activity Spreadsheet -- Enzyme Inhibition Constant Data from BindingDB
Found 3 hits for monomerid = 196660
TargetD-amino-acid oxidase(Homo sapiens (Human))
Takeda Pharmaceutical
US Patent
LigandPNGBDBM196660(US10202399, Example 20 | US9212147, 20)
Affinity DataIC50:  2.5nMpH: 7.5 T: 2°C. Assay description: The DAAO inhibitory activity was measured by assaying the amount of hydrogen peroxide (H2O2) produced by reacting DAAO protein with flavin adenine di...
Ligand InfoPC cidPC sid
In DepthDetails US Patent
TargetD-amino-acid oxidase(Homo sapiens (Human))
Takeda Pharmaceutical
US Patent
LigandPNGBDBM196660(US10202399, Example 20 | US9212147, 20)
Affinity DataIC50:  2.5nM. Assay description: The DAAO inhibitory activity was measured by assaying the amount of hydrogen peroxide (H2O2) produced by reacting DAAO protein with flavin adenine di...
Ligand InfoPC cidPC sid
In DepthDetails US Patent
TargetD-amino-acid oxidase(Homo sapiens (Human))
Takeda Pharmaceutical
US Patent
LigandPNGBDBM196660(US10202399, Example 20 | US9212147, 20)
Affinity DataIC50:  4.60nMpH: 7.5 T: 2°C. Assay description: This test was performed by partially modifying the method of Philip et. al. (J. Biomol. Screen. Vol. 11, pp 481-487, 2006). HEK293 cells that stably ...
Ligand InfoPC cidPC sid
In DepthDetails US Patent