BDBM197172 AdoHcy
SMILES C[S+](CCC([NH3+])C([O-])=O)C[C@H]1O[C@H]([C@H](O)[C@@H]1O)n1cnc2c(N)ncnc12
InChI Key InChIKey=MEFKEPWMEQBLKI-YDBXVIPQSA-O
Data  1 IC50
  Tab Delimited (TSV)   2D SDfile   Computed 3D by Vconf -m prep SDfile
Find this compound or compounds like it in BindingDB:
Activity Spreadsheet -- Enzyme Inhibition Constant Data from BindingDB
Found 1 hit for monomerid = 197172
TargetNicotinamide N-methyltransferase(Homo sapiens (Human))
Utrecht University
LigandPNGBDBM197172(AdoHcy)
Affinity DataIC50:  2.63E+4nMpH: 8.6 T: 2°C. Assay description: Enzyme activity assays were performed as previously described with NNMT (16.25 ug/mL, 550 nM) in 50 mM Tris buffer (pH 8.6) containing 1 mM DTT (all ...
In DepthDetails ArticlePubMed