BDBM19719 (2S)-4,4-dimethyl-2-(morpholin-4-ylcarbonylamino)-N-(2-{[4-(trifluoromethoxy)phenyl]amino}ethyl)pentanamide::arylaminoethyl amide deriv. 33
SMILES CC(C)(C)C[C@H](NC(=O)N1CCOCC1)C(=O)NCCNc1ccc(OC(F)(F)F)cc1
InChI Key InChIKey=KNOJAPCNRYZFOZ-KRWDZBQOSA-N
Data  3 KI
  Tab Delimited (TSV)   2D SDfile   Computed 3D by Vconf -m prep SDfile
Find this compound or compounds like it in BindingDB:
Activity Spreadsheet -- Enzyme Inhibition Constant Data from BindingDB
Found 3 hits for monomerid = 19719
TargetCathepsin S(Homo sapiens (Human))
Gnf
LigandPNGBDBM19719((2S)-4,4-dimethyl-2-(morpholin-4-ylcarbonylamino)-...)
Affinity DataKi:  220nM ΔG°:  -9.44kcal/molepH: 5.5 T: 2°C. Assay description: The recombinant human cathepsin enzyme was preincubated with inhibitor for 20 minutes prior to addition of substrate. The substrate hydrolysis was mo...
In DepthDetails ArticlePubMed
TargetCathepsin K(Homo sapiens (Human))
Gnf
LigandPNGBDBM19719((2S)-4,4-dimethyl-2-(morpholin-4-ylcarbonylamino)-...)
Affinity DataKi:  1.33E+3nM. Assay description: The recombinant human cathepsin enzyme was preincubated with inhibitor for 20 minutes prior to addition of substrate. The substrate hydrolysis was mo...
In DepthDetails ArticlePubMed
TargetProcathepsin L(Homo sapiens (Human))
Gnf
LigandPNGBDBM19719((2S)-4,4-dimethyl-2-(morpholin-4-ylcarbonylamino)-...)
Affinity DataKi: >3.00E+4nM. Assay description: The recombinant human cathepsin enzyme was preincubated with inhibitor for 20 minutes prior to addition of substrate. The substrate hydrolysis was mo...
In DepthDetails ArticlePubMed