BDBM197240 US9090621, 22B
SMILES Nc1ncnc2n(CC3CCCN3C(=O)C(=CC3CC3)C#N)nc(-c3ccc(Oc4ccccc4)cc3)c12
InChI Key InChIKey=FPHXGYHQFBCZMT-UHFFFAOYSA-N
Data  1 IC50
  Tab Delimited (TSV)   2D SDfile   Computed 3D by Vconf -m prep SDfile
Find this compound or compounds like it in BindingDB:
Activity Spreadsheet -- Enzyme Inhibition Constant Data from BindingDB
Found 1 hit for monomerid = 197240
TargetTyrosine-protein kinase BTK(Homo sapiens (Human))
Principia Biopharma
US Patent
LigandPNGBDBM197240(US9090621, 22B)
Affinity DataIC50:  2.60nMT: 2°C. Assay description: A Caliper-based kinase assay (Caliper Life Sciences, Hopkinton, Mass.) was used to measure inhibition of Btk kinase activity of a compound of Formula...
Ligand InfoPC cidPC sid
In DepthDetails US Patent