BDBM197347 5-(2,5-difluorophenyl)-2-(((4-methoxyphenyl)(methyl)amino)methyl)-6,7-dihydropyrazolo[1,5-a]pyrazin-4(5h)-one::US9676782, 106::US9676782, 110
SMILES COc1ccc(cc1)N(C)Cc1cc2C(=O)N(CCn2n1)c1c(F)cccc1F
InChI Key InChIKey=LGTZPXQTUYQLNO-UHFFFAOYSA-N
Data  4 IC50
  Tab Delimited (TSV)   2D SDfile   Computed 3D by Vconf -m prep SDfile
Find this compound or compounds like it in BindingDB:
Activity Spreadsheet -- Enzyme Inhibition Constant Data from BindingDB
Found 4 hits for monomerid = 197347
TargetMetabotropic glutamate receptor 3(Rattus norvegicus (Rat))
Vanderbilt University
US Patent
LigandPNGBDBM197347(5-(2,5-difluorophenyl)-2-(((4-methoxyphenyl)(methy...)
Affinity DataIC50:  1.02E+3nMT: 2°C. Assay description: HEK 293A cells stably expressing rat mGlu5 were plated in black-walled, clear-bottomed, poly-D-lysine coated 384-well plates in 20 μL of assay m...
Ligand InfoPC cidPC sid
In DepthDetails US Patent
TargetMetabotropic glutamate receptor 5(Rattus norvegicus (Rat))
Vanderbilt University
US Patent
LigandPNGBDBM197347(5-(2,5-difluorophenyl)-2-(((4-methoxyphenyl)(methy...)
Affinity DataIC50:  3.00E+4nMT: 2°C. Assay description: Gα15/TREx cells stably expressing rat mGlu3 were plated in black-walled, clear-bottomed, poly-D-lysine coated 384-well plates in 20 μL of a...
Ligand InfoPC cidPC sid
In DepthDetails US Patent
TargetMetabotropic glutamate receptor 3(Rattus norvegicus (Rat))
Vanderbilt University
US Patent
LigandPNGBDBM197347(5-(2,5-difluorophenyl)-2-(((4-methoxyphenyl)(methy...)
Affinity DataIC50:  1.64E+3nMT: 2°C. Assay description: HEK 293A cells stably expressing rat mGlu5 were plated in black-walled, clear-bottomed, poly-D-lysine coated 384-well plates in 20 μL of assay m...
Ligand InfoPC cidPC sid
In DepthDetails US Patent
TargetMetabotropic glutamate receptor 5(Rattus norvegicus (Rat))
Vanderbilt University
US Patent
LigandPNGBDBM197347(5-(2,5-difluorophenyl)-2-(((4-methoxyphenyl)(methy...)
Affinity DataIC50:  3.00E+4nMT: 2°C. Assay description: Gα15/TREx cells stably expressing rat mGlu3 were plated in black-walled, clear-bottomed, poly-D-lysine coated 384-well plates in 20 μL of a...
Ligand InfoPC cidPC sid
In DepthDetails US Patent