BDBM197385 2-(((4-methoxyphenyl)(methyl)amino)methyl)-5-(2-methylthiazol-4-yl)-6,7-dihydropyrazolo[1,5-a]pyrazin-4(5h)-one::US9676782, 115
SMILES COc1ccc(cc1)N(C)Cc1cc2C(=O)N(CCn2n1)c1csc(C)n1
InChI Key InChIKey=SKXOVBLTQNGDHK-UHFFFAOYSA-N
Data  2 IC50
  Tab Delimited (TSV)   2D SDfile   Computed 3D by Vconf -m prep SDfile
Find this compound or compounds like it in BindingDB:
Activity Spreadsheet -- Enzyme Inhibition Constant Data from BindingDB
Found 2 hits for monomerid = 197385
TargetMetabotropic glutamate receptor 5(Rattus norvegicus (Rat))
Vanderbilt University
US Patent
LigandPNGBDBM197385(2-(((4-methoxyphenyl)(methyl)amino)methyl)-5-(2-me...)
Affinity DataIC50:  3.00E+4nMT: 2°C. Assay description: Gα15/TREx cells stably expressing rat mGlu3 were plated in black-walled, clear-bottomed, poly-D-lysine coated 384-well plates in 20 μL of a...
Ligand InfoPC cidPC sid
In DepthDetails US Patent
TargetMetabotropic glutamate receptor 3(Rattus norvegicus (Rat))
Vanderbilt University
US Patent
LigandPNGBDBM197385(2-(((4-methoxyphenyl)(methyl)amino)methyl)-5-(2-me...)
Affinity DataIC50:  1.62E+3nMT: 2°C. Assay description: HEK 293A cells stably expressing rat mGlu5 were plated in black-walled, clear-bottomed, poly-D-lysine coated 384-well plates in 20 μL of assay m...
Ligand InfoPC cidPC sid
In DepthDetails US Patent