BDBM197403 US9216968, 1::US9732066, 1
SMILES FC(F)(F)c1ccccc1CNC(=O)c1cc(NC(=O)c2ccccc2C(F)(F)F)cc2[nH]cnc12
InChI Key InChIKey=BMTCRCXHIHJYFN-UHFFFAOYSA-N
Data  2 IC50
  Tab Delimited (TSV)   2D SDfile   Computed 3D by Vconf -m prep SDfile
Find this compound or compounds like it in BindingDB:
Activity Spreadsheet -- Enzyme Inhibition Constant Data from BindingDB
Found 2 hits for monomerid = 197403
TargetProstaglandin E synthase(Homo sapiens (Human))
Nippon Shinyaku
US Patent
LigandPNGBDBM197403(US9216968, 1 | US9732066, 1)
Affinity DataIC50:  12.7nM. Assay description: mPGES-1 microsome fractions were prepared from CHO-K1 cells transiently transfected with plasmid encoding the human mPGES-1cDNA. Microsomes were dilu...
Ligand InfoPC cidPC sid
In DepthDetails US Patent
TargetProstaglandin E synthase(Homo sapiens (Human))
Nippon Shinyaku
US Patent
LigandPNGBDBM197403(US9216968, 1 | US9732066, 1)
Affinity DataIC50:  12.7nM. Assay description: mPGES-1 microsome fractions were prepared from CHO-K1 cells transiently transfected with plasmid encoding the human mPGES-1cDNA. Microsomes were dilu...
Ligand InfoPC cidPC sid
In DepthDetails US Patent