BDBM197527 US9216968, 127::US9732066, 127
SMILES Cc1c(Cl)cccc1NC(=O)c1cc(NC(=O)c2c(F)cccc2Cl)cc2[nH]c(nc12)[C@H]1CCCO1
InChI Key
Data  2 IC50
  Tab Delimited (TSV)   2D SDfile   Computed 3D by Vconf -m prep SDfile
Find this compound or compounds like it in BindingDB:
Activity Spreadsheet -- Enzyme Inhibition Constant Data from BindingDB
Found 2 hits for monomerid = 197527
TargetProstaglandin E synthase(Homo sapiens (Human))
Nippon Shinyaku
US Patent
LigandPNGBDBM197527(US9216968, 127 | US9732066, 127)
Affinity DataIC50:  6.30nM. Assay description: mPGES-1 microsome fractions were prepared from CHO-K1 cells transiently transfected with plasmid encoding the human mPGES-1cDNA. Microsomes were dilu...
Ligand InfoPC cidPC sid
In DepthDetails US Patent
TargetProstaglandin E synthase(Homo sapiens (Human))
Nippon Shinyaku
US Patent
LigandPNGBDBM197527(US9216968, 127 | US9732066, 127)
Affinity DataIC50:  6.30nM. Assay description: mPGES-1 microsome fractions were prepared from CHO-K1 cells transiently transfected with plasmid encoding the human mPGES-1cDNA. Microsomes were dilu...
Ligand InfoPC cidPC sid
In DepthDetails US Patent