BDBM197681 US9216981, 9
SMILES [O-][N+](=O)c1ccccc1CS(=O)(=O)Nc1ccc(F)c(Nc2ncccc2-c2ncnc3[nH]cnc23)c1F
InChI Key InChIKey=MAXUDKMCUTVIEB-UHFFFAOYSA-N
Data  1 IC50  1 EC50
  Tab Delimited (TSV)   2D SDfile   Computed 3D by Vconf -m prep SDfile
Find this compound or compounds like it in BindingDB:
Activity Spreadsheet -- Enzyme Inhibition Constant Data from BindingDB
Found 2 hits for monomerid = 197681
TargetSerine/threonine-protein kinase B-raf(Homo sapiens (Human))
Medpacto
US Patent
LigandPNGBDBM197681(US9216981, 9)
Affinity DataEC50:  1.12E+4nMT: 2°C. Assay description: To check the B-Raf cell activity inhibitory capability of the compounds of the present invention, the following experiments were conducted in A375P...
Ligand InfoPC cidPC sid
In DepthDetails US Patent
TargetSerine/threonine-protein kinase B-raf(Homo sapiens (Human))
Medpacto
US Patent
LigandPNGBDBM197681(US9216981, 9)
Affinity DataIC50:  1.50E+3nMpH: 7.2 T: 2°C. Assay description: To check the B-Raf kinase inhibitory activity of the compounds of the present invention, the following experiments were conducted.(1) Serial Signalin...
Ligand InfoPC cidPC sid
In DepthDetails US Patent