BDBM198303 US9216999, 110::US9556187, Example 110
SMILES FC(F)(F)Oc1ccc(CNC[C@H]2CC[C@@H](CC2)c2nnn3cnc4[nH]ccc4c23)cc1
InChI Key
Data  9 IC50
  Tab Delimited (TSV)   2D SDfile   Computed 3D by Vconf -m prep SDfile
Find this compound or compounds like it in BindingDB:
Activity Spreadsheet -- Enzyme Inhibition Constant Data from BindingDB
Found 9 hits for monomerid = 198303
TargetTyrosine-protein kinase JAK2(Homo sapiens (Human))
Nissan Chemical Industries
US Patent
LigandPNGBDBM198303(US9216999, 110 | US9556187, Example 110)
Affinity DataIC50:  91nMpH: 7.5Assay Description:JAK1, JAK2, JAK3 and Tyk2 were purchased from Carna Biosciences, Inc. As the substrate, LANCE Ultra ULight-JAK1 Peptide (manufactured by PerkinElmer ...
Ligand InfoPC cidPC sid
In DepthDetails US Patent
TargetTyrosine-protein kinase JAK3(Homo sapiens (Human))
Nissan Chemical Industries
US Patent
LigandPNGBDBM198303(US9216999, 110 | US9556187, Example 110)
Affinity DataIC50:  510nMpH: 7.5Assay Description:JAK1, JAK2, JAK3 and Tyk2 were purchased from Carna Biosciences, Inc. As the substrate, LANCE Ultra ULight-JAK1 Peptide (manufactured by PerkinElmer ...
Ligand InfoPC cidPC sid
In DepthDetails US Patent
TargetNon-receptor tyrosine-protein kinase TYK2(Homo sapiens (Human))
Nissan Chemical Industries
US Patent
LigandPNGBDBM198303(US9216999, 110 | US9556187, Example 110)
Affinity DataIC50:  4.90nMpH: 7.5Assay Description:JAK1, JAK2, JAK3 and Tyk2 were purchased from Carna Biosciences, Inc. As the substrate, LANCE Ultra ULight-JAK1 Peptide (manufactured by PerkinElmer ...
Ligand InfoPC cidPC sid
In DepthDetails US Patent
TargetTyrosine-protein kinase JAK1(Homo sapiens (Human))
Nissan Chemical Industries
US Patent
LigandPNGBDBM198303(US9216999, 110 | US9556187, Example 110)
Affinity DataIC50:  5.60nMpH: 7.5Assay Description:JAK1, JAK2, JAK3 and Tyk2 were purchased from Carna Biosciences, Inc. As the substrate, LANCE Ultra ULight-JAK1 Peptide (manufactured by PerkinElmer ...
Ligand InfoPC cidPC sid
In DepthDetails US Patent
TargetTyrosine-protein kinase JAK1(Homo sapiens (Human))
Nissan Chemical Industries
US Patent
LigandPNGBDBM198303(US9216999, 110 | US9556187, Example 110)
Affinity DataIC50:  420nMT: 2°C. Assay description: JAK1, JAK2, JAK3 and Tyk2 were purchased from Carna Biosciences, Inc. As the substrate, LANCE Ultra ULight-JAK1 Peptide (manufactured by PerkinElmer ...
Ligand InfoPC cidPC sid
In DepthDetails US Patent
TargetTyrosine-protein kinase JAK2(Homo sapiens (Human))
Nissan Chemical Industries
US Patent
LigandPNGBDBM198303(US9216999, 110 | US9556187, Example 110)
Affinity DataIC50:  91nMT: 2°C. Assay description: JAK1, JAK2, JAK3 and Tyk2 were purchased from Carna Biosciences, Inc. As the substrate, LANCE Ultra ULight-JAK1 Peptide (manufactured by PerkinElmer ...
Ligand InfoPC cidPC sid
In DepthDetails US Patent
TargetTyrosine-protein kinase JAK3(Homo sapiens (Human))
Nissan Chemical Industries
US Patent
LigandPNGBDBM198303(US9216999, 110 | US9556187, Example 110)
Affinity DataIC50:  510nMT: 2°C. Assay description: JAK1, JAK2, JAK3 and Tyk2 were purchased from Carna Biosciences, Inc. As the substrate, LANCE Ultra ULight-JAK1 Peptide (manufactured by PerkinElmer ...
Ligand InfoPC cidPC sid
In DepthDetails US Patent
TargetNon-receptor tyrosine-protein kinase TYK2(Homo sapiens (Human))
Nissan Chemical Industries
US Patent
LigandPNGBDBM198303(US9216999, 110 | US9556187, Example 110)
Affinity DataIC50:  4.90nMT: 2°C. Assay description: JAK1, JAK2, JAK3 and Tyk2 were purchased from Carna Biosciences, Inc. As the substrate, LANCE Ultra ULight-JAK1 Peptide (manufactured by PerkinElmer ...
Ligand InfoPC cidPC sid
In DepthDetails US Patent
TargetTyrosine-protein kinase JAK1(Homo sapiens (Human))
Nissan Chemical Industries
US Patent
LigandPNGBDBM198303(US9216999, 110 | US9556187, Example 110)
Affinity DataIC50:  5.60nMT: 2°C. Assay description: JAK1, JAK2, JAK3 and Tyk2 were purchased from Carna Biosciences, Inc. As the substrate, LANCE Ultra ULight-JAK1 Peptide (manufactured by PerkinElmer ...
Ligand InfoPC cidPC sid
In DepthDetails US Patent