BDBM198335 US9216999, 138a::US9556187, Example 138a
SMILES FC(F)(F)c1ccc(CN[C@H]2CC[C@H](CC2)c2nnn3cnc4[nH]ccc4c23)cc1
InChI Key
Data  7 IC50
  Tab Delimited (TSV)   2D SDfile   Computed 3D by Vconf -m prep SDfile
Find this compound or compounds like it in BindingDB:
Activity Spreadsheet -- Enzyme Inhibition Constant Data from BindingDB
Found 7 hits for monomerid = 198335
TargetTyrosine-protein kinase JAK2(Homo sapiens (Human))
Nissan Chemical Industries
US Patent
LigandPNGBDBM198335(US9216999, 138a | US9556187, Example 138a)
Affinity DataIC50:  740nMpH: 7.5Assay Description:JAK1, JAK2, JAK3 and Tyk2 were purchased from Carna Biosciences, Inc. As the substrate, LANCE Ultra ULight-JAK1 Peptide (manufactured by PerkinElmer ...
Ligand InfoPC cidPC sid
In DepthDetails US Patent
TargetTyrosine-protein kinase JAK3(Homo sapiens (Human))
Nissan Chemical Industries
US Patent
LigandPNGBDBM198335(US9216999, 138a | US9556187, Example 138a)
Affinity DataIC50: >1.00E+3nMpH: 7.5Assay Description:JAK1, JAK2, JAK3 and Tyk2 were purchased from Carna Biosciences, Inc. As the substrate, LANCE Ultra ULight-JAK1 Peptide (manufactured by PerkinElmer ...
Ligand InfoPC cidPC sid
In DepthDetails US Patent
TargetNon-receptor tyrosine-protein kinase TYK2(Homo sapiens (Human))
Nissan Chemical Industries
US Patent
LigandPNGBDBM198335(US9216999, 138a | US9556187, Example 138a)
Affinity DataIC50:  250nMpH: 7.5Assay Description:JAK1, JAK2, JAK3 and Tyk2 were purchased from Carna Biosciences, Inc. As the substrate, LANCE Ultra ULight-JAK1 Peptide (manufactured by PerkinElmer ...
Ligand InfoPC cidPC sid
In DepthDetails US Patent
TargetNon-receptor tyrosine-protein kinase TYK2(Homo sapiens (Human))
Nissan Chemical Industries
US Patent
LigandPNGBDBM198335(US9216999, 138a | US9556187, Example 138a)
Affinity DataIC50:  250nMT: 2°C. Assay description: JAK1, JAK2, JAK3 and Tyk2 were purchased from Carna Biosciences, Inc. As the substrate, LANCE Ultra ULight-JAK1 Peptide (manufactured by PerkinElmer ...
Ligand InfoPC cidPC sid
In DepthDetails US Patent
TargetTyrosine-protein kinase JAK1(Homo sapiens (Human))
Nissan Chemical Industries
US Patent
LigandPNGBDBM198335(US9216999, 138a | US9556187, Example 138a)
Affinity DataIC50:  23nMT: 2°C. Assay description: JAK1, JAK2, JAK3 and Tyk2 were purchased from Carna Biosciences, Inc. As the substrate, LANCE Ultra ULight-JAK1 Peptide (manufactured by PerkinElmer ...
Ligand InfoPC cidPC sid
In DepthDetails US Patent
TargetTyrosine-protein kinase JAK2(Homo sapiens (Human))
Nissan Chemical Industries
US Patent
LigandPNGBDBM198335(US9216999, 138a | US9556187, Example 138a)
Affinity DataIC50:  740nMT: 2°C. Assay description: JAK1, JAK2, JAK3 and Tyk2 were purchased from Carna Biosciences, Inc. As the substrate, LANCE Ultra ULight-JAK1 Peptide (manufactured by PerkinElmer ...
Ligand InfoPC cidPC sid
In DepthDetails US Patent
TargetTyrosine-protein kinase JAK1(Homo sapiens (Human))
Nissan Chemical Industries
US Patent
LigandPNGBDBM198335(US9216999, 138a | US9556187, Example 138a)
Affinity DataIC50:  23nMpH: 7.5Assay Description:JAK1, JAK2, JAK3 and Tyk2 were purchased from Carna Biosciences, Inc. As the substrate, LANCE Ultra ULight-JAK1 Peptide (manufactured by PerkinElmer ...
Ligand InfoPC cidPC sid
In DepthDetails US Patent