BDBM198784 US9221796, 76
SMILES Cc1ccccc1CN1CCC(N2CC[C@@H]([C@@H](F)C2)c2ccc(O)cc2)C1=O
InChI Key InChIKey=HFWJQXYJEYZULI-LKXRKSRJSA-N
Data  1 KI
  Tab Delimited (TSV)   2D SDfile   Computed 3D by Vconf -m prep SDfile
Find this compound or compounds like it in BindingDB:
Activity Spreadsheet -- Enzyme Inhibition Constant Data from BindingDB
Found 1 hit for monomerid = 198784
TargetGlutamate receptor ionotropic, NMDA 2B(Rattus norvegicus (Rat))
Bristol-Myers Squibb
US Patent
LigandPNGBDBM198784(US9221796, 76)
Affinity DataKi:  33nM ΔG°:  -11.1kcal/moleT: 2°C. Assay description: To perform the competition binding assay, thawed membrane homogenate was added to each well of a 96-well plate (20 ug/well). The experimental compo...
Ligand InfoPC cidPC sid
In DepthDetails US Patent