BDBM19892 (2R)-N-(cyanomethyl)-2-(3-{4-[4-(2-hydroxyethyl)piperazin-1-yl]phenyl}phenyl)-4-methylpentanamide::Nonpeptidic Biaryl Nitrile Compound, 12
SMILES CC(C)C[C@@H](C(=O)NCC#N)c1cccc(c1)-c1ccc(cc1)N1CCN(CCO)CC1
InChI Key InChIKey=WNBYROIOFHRCHS-RUZDIDTESA-N
Data  4 IC50
  Tab Delimited (TSV)   2D SDfile   Computed 3D by Vconf -m prep SDfile
Find this compound or compounds like it in BindingDB:
Activity Spreadsheet -- Enzyme Inhibition Constant Data from BindingDB
Found 4 hits for monomerid = 19892
TargetCathepsin K(Homo sapiens (Human))
Merck Frosst Centre For Therapeutic Research
LigandPNGBDBM19892((2R)-N-(cyanomethyl)-2-(3-{4-[4-(2-hydroxyethyl)pi...)
Affinity DataIC50:  12nM. Assay description: Prior to the addition of substrate, different concentrations of the inhibitor ranging from 100 uM to 0.2 nM were preincubated for 15 min with enzyme ...
In DepthDetails ArticlePubMed
TargetCathepsin B(Homo sapiens (Human))
Merck Frosst Centre For Therapeutic Research
LigandPNGBDBM19892((2R)-N-(cyanomethyl)-2-(3-{4-[4-(2-hydroxyethyl)pi...)
Affinity DataIC50:  3.34E+3nM. Assay description: Prior to the addition of substrate, different concentrations of the inhibitor ranging from 100 uM to 0.2 nM were preincubated for 15 min with enzyme ...
In DepthDetails ArticlePubMed
TargetCathepsin S(Homo sapiens (Human))
Merck Frosst Centre For Therapeutic Research
LigandPNGBDBM19892((2R)-N-(cyanomethyl)-2-(3-{4-[4-(2-hydroxyethyl)pi...)
Affinity DataIC50:  609nM. Assay description: Prior to the addition of substrate, different concentrations of the inhibitor ranging from 100 uM to 0.2 nM were preincubated for 15 min with enzyme ...
In DepthDetails ArticlePubMed
TargetProcathepsin L(Homo sapiens (Human))
Merck Frosst Centre For Therapeutic Research
LigandPNGBDBM19892((2R)-N-(cyanomethyl)-2-(3-{4-[4-(2-hydroxyethyl)pi...)
Affinity DataIC50:  140nM. Assay description: Prior to the addition of substrate, different concentrations of the inhibitor ranging from 100 uM to 0.2 nM were preincubated for 15 min with enzyme ...
In DepthDetails ArticlePubMed