BDBM19898 N-(cyanomethyl)-3-cyclopropyl-2-{3-[4-(4-methylpiperazin-1-yl)phenyl]phenyl}propanamide::Nonpeptidic Biaryl Nitrile Compound, 28d
SMILES CN1CCN(CC1)c1ccc(cc1)-c1cccc(c1)C(CC1CC1)C(=O)NCC#N
InChI Key InChIKey=OMUUAINOWNXZJK-UHFFFAOYSA-N
Data  4 IC50
  Tab Delimited (TSV)   2D SDfile   Computed 3D by Vconf -m prep SDfile
Find this compound or compounds like it in BindingDB:
Activity Spreadsheet -- Enzyme Inhibition Constant Data from BindingDB
Found 4 hits for monomerid = 19898
TargetCathepsin K(Homo sapiens (Human))
Merck Frosst Centre For Therapeutic Research
LigandPNGBDBM19898(N-(cyanomethyl)-3-cyclopropyl-2-{3-[4-(4-methylpip...)
Affinity DataIC50:  65nM. Assay description: Prior to the addition of substrate, different concentrations of the inhibitor ranging from 100 uM to 0.2 nM were preincubated for 15 min with enzyme ...
In DepthDetails ArticlePubMed
TargetCathepsin B(Homo sapiens (Human))
Merck Frosst Centre For Therapeutic Research
LigandPNGBDBM19898(N-(cyanomethyl)-3-cyclopropyl-2-{3-[4-(4-methylpip...)
Affinity DataIC50:  3.43E+3nM. Assay description: Prior to the addition of substrate, different concentrations of the inhibitor ranging from 100 uM to 0.2 nM were preincubated for 15 min with enzyme ...
In DepthDetails ArticlePubMed
TargetCathepsin S(Homo sapiens (Human))
Merck Frosst Centre For Therapeutic Research
LigandPNGBDBM19898(N-(cyanomethyl)-3-cyclopropyl-2-{3-[4-(4-methylpip...)
Affinity DataIC50:  6.60E+3nM. Assay description: Prior to the addition of substrate, different concentrations of the inhibitor ranging from 100 uM to 0.2 nM were preincubated for 15 min with enzyme ...
In DepthDetails ArticlePubMed
TargetProcathepsin L(Homo sapiens (Human))
Merck Frosst Centre For Therapeutic Research
LigandPNGBDBM19898(N-(cyanomethyl)-3-cyclopropyl-2-{3-[4-(4-methylpip...)
Affinity DataIC50: >1.00E+4nM. Assay description: Prior to the addition of substrate, different concentrations of the inhibitor ranging from 100 uM to 0.2 nM were preincubated for 15 min with enzyme ...
In DepthDetails ArticlePubMed