BDBM199207 US9216998, 19
SMILES NS(=O)(=O)N1CCn2c(CCc3ccccc3)c(c3cccc(C1)c23)C(F)(F)F
InChI Key InChIKey=JWKWUWFEHZTLSJ-UHFFFAOYSA-N
Data  2 IC50
  Tab Delimited (TSV)   2D SDfile   Computed 3D by Vconf -m prep SDfile
Find this compound or compounds like it in BindingDB:
Activity Spreadsheet -- Enzyme Inhibition Constant Data from BindingDB
Found 2 hits for monomerid = 199207
TargetEndothelial lipase(Mus musculus (Mouse))
Janssen Pharmaceutica
US Patent
LigandPNGBDBM199207(US9216998, 19)
Affinity DataIC50:  87nMpH: 7.2Assay Description:To assay for cell surface lipase activity, cells expressing human endothelial lipase (EL) or LPL were plated in CellBIND® 384-well plates (Corning, L...
Ligand InfoPC cidPC sid
In DepthDetails US Patent
TargetEndothelial lipase(Homo sapiens (Human))
Janssen Pharmaceutica
US Patent
LigandPNGBDBM199207(US9216998, 19)
Affinity DataIC50:  68nMpH: 7.2Assay Description:To assay for cell surface lipase activity, cells expressing human endothelial lipase (EL) or LPL were plated in CellBIND® 384-well plates (Corning, L...
Ligand InfoPC cidPC sid
In DepthDetails US Patent