BDBM199362 US9221831, 27
SMILES CO[C@]12CC[C@@]3(C[C@@H]1CNCc1ccccc1)[C@H]1Cc4ccc(O)c5O[C@@H]2[C@]3(CCN1CC1CC1)c45
InChI Key InChIKey=BULKLYPQLVOONH-VTPACTEHSA-N
Data  3 KI  2 EC50
  Tab Delimited (TSV)   2D SDfile   Computed 3D by Vconf -m prep SDfile
Find this compound or compounds like it in BindingDB:
Activity Spreadsheet -- Enzyme Inhibition Constant Data from BindingDB
Found 5 hits for monomerid = 199362
TargetKappa-type opioid receptor(Homo sapiens (Human))
Purdue Pharma
US Patent
LigandPNGBDBM199362(US9221831, 27)
Affinity DataKi:  6.69nMpH: 7.4Assay Description:Radioligand dose displacement assays used 0.4 nM [3H]-U69,593 (GE Healthcare, Piscataway, N.J.; 40 Ci/mmole) with 15 μg membrane protein (recomb...
Ligand InfoPC cidPC sid
In DepthDetails US Patent
TargetMu-type opioid receptor(Homo sapiens (Human))
Purdue Pharma
US Patent
LigandPNGBDBM199362(US9221831, 27)
Affinity DataKi:  37.5nM ΔG°:  -11.0kcal/molepH: 7.4 T: 2°C. Assay description: Radioligand dose-displacement binding assays for t-opioid receptors used 0.3 nM [3H]-diprenorphine (Perkin Elmer, Shelton, Conn.), with 5 mg membrane...
Ligand InfoPC cidPC sid
In DepthDetails US Patent
TargetDelta-type opioid receptor(Homo sapiens (Human))
Purdue Pharma
US Patent
LigandPNGBDBM199362(US9221831, 27)
Affinity DataKi:  2.43E+3nM ΔG°:  -7.65kcal/molepH: 7.4 T: 2°C. Assay description: Delta-opioid Receptor Binding Assay Procedures were conducted as follows. Radioligand dose-displacement assays used 0.3 nM [3H]-Naltrindole (Perkin...
Ligand InfoPC cidPC sid
In DepthDetails US Patent
TargetKappa-type opioid receptor(Homo sapiens (Human))
Purdue Pharma
US Patent
LigandPNGBDBM199362(US9221831, 27)
Affinity DataEC50:  108nMpH: 7.4 T: 2°C. Assay description: Functional [35S]GTPgammaS binding assays were conducted as follows. κ opioid receptor membrane solution was prepared by sequentially adding final ...
Ligand InfoPC cidPC sid
In DepthDetails US Patent
TargetDelta-type opioid receptor(Homo sapiens (Human))
Purdue Pharma
US Patent
LigandPNGBDBM199362(US9221831, 27)
Affinity DataEC50:  431nMpH: 7.4 T: 2°C. Assay description: Functional [35S]GTPgammaS binding assays were conducted as follows. Delta opioid receptor membrane solution was prepared by sequentially adding fin...
Ligand InfoPC cidPC sid
In DepthDetails US Patent