BDBM199369 US9221831, 34
SMILES COCCOCCOCCOCCOCCOC[C@H]1C[C@]23CC[C@]1(OC)[C@@H]1Oc4c5c(C[C@H]2N(CC2CC2)CC[C@@]315)ccc4OC
InChI Key InChIKey=AOUNVUHADLIPSM-QTDSEMIKSA-N
Data  3 KI  1 EC50
  Tab Delimited (TSV)   2D SDfile   Computed 3D by Vconf -m prep SDfile
Find this compound or compounds like it in BindingDB:
Activity Spreadsheet -- Enzyme Inhibition Constant Data from BindingDB
Found 4 hits for monomerid = 199369
TargetKappa-type opioid receptor(Homo sapiens (Human))
Purdue Pharma
US Patent
LigandPNGBDBM199369(US9221831, 34)
Affinity DataKi:  47.1nMpH: 7.4Assay Description:Radioligand dose displacement assays used 0.4 nM [3H]-U69,593 (GE Healthcare, Piscataway, N.J.; 40 Ci/mmole) with 15 μg membrane protein (recomb...
Ligand InfoPC cidPC sid
In DepthDetails US Patent
TargetMu-type opioid receptor(Homo sapiens (Human))
Purdue Pharma
US Patent
LigandPNGBDBM199369(US9221831, 34)
Affinity DataKi:  216nM ΔG°:  -9.85kcal/molepH: 7.4 T: 2°C. Assay description: Radioligand dose-displacement binding assays for t-opioid receptors used 0.3 nM [3H]-diprenorphine (Perkin Elmer, Shelton, Conn.), with 5 mg membrane...
Ligand InfoPC cidPC sid
In DepthDetails US Patent
TargetDelta-type opioid receptor(Homo sapiens (Human))
Purdue Pharma
US Patent
LigandPNGBDBM199369(US9221831, 34)
Affinity DataKi:  5.53E+3nM ΔG°:  -7.17kcal/molepH: 7.4 T: 2°C. Assay description: Delta-opioid Receptor Binding Assay Procedures were conducted as follows. Radioligand dose-displacement assays used 0.3 nM [3H]-Naltrindole (Perkin...
Ligand InfoPC cidPC sid
In DepthDetails US Patent
TargetKappa-type opioid receptor(Homo sapiens (Human))
Purdue Pharma
US Patent
LigandPNGBDBM199369(US9221831, 34)
Affinity DataEC50:  817nMpH: 7.4 T: 2°C. Assay description: Functional [35S]GTPgammaS binding assays were conducted as follows. κ opioid receptor membrane solution was prepared by sequentially adding final ...
Ligand InfoPC cidPC sid
In DepthDetails US Patent