BDBM19999 2-(4-{3-[3-benzoyl-8-(trifluoromethyl)quinolin-4-yl]phenoxymethyl}phenyl)acetic acid::Quinoline 14
SMILES OC(=O)Cc1ccc(COc2cccc(c2)-c2c(cnc3c(cccc23)C(F)(F)F)C(=O)c2ccccc2)cc1
InChI Key InChIKey=YAKODSHNCZYDPB-UHFFFAOYSA-N
Data  2 IC50  1 EC50
  Tab Delimited (TSV)   2D SDfile   Computed 3D by Vconf -m prep SDfile
Find this compound or compounds like it in BindingDB:
Activity Spreadsheet -- Enzyme Inhibition Constant Data from BindingDB
Found 2 hits for monomerid = 19999
TargetOxysterols receptor LXR-beta [154-461](Homo sapiens (Human))
Wyeth Research
LigandPNGBDBM19999(2-(4-{3-[3-benzoyl-8-(trifluoromethyl)quinolin-4-y...)
Affinity DataIC50:  5nM EC50:  143nMpH: 7.4 T: 2°C. Assay description: Binding reaction was initiated by adding a dilution series of test compound in tracer solution to LXR-coated flash plates. Each concentration of test...
In DepthDetails ArticlePubMed
TargetOxysterols receptor LXR-alpha [197-447](Homo sapiens (Human))
Wyeth Research
LigandPNGBDBM19999(2-(4-{3-[3-benzoyl-8-(trifluoromethyl)quinolin-4-y...)
Affinity DataIC50:  16.5nMpH: 7.4 T: 2°C. Assay description: Binding reaction was initiated by adding a dilution series of test compound in tracer solution to LXR-coated flash plates. Each concentration of test...
In DepthDetails ArticlePubMed