BDBM2000 6-amino-10-ethyl-13,14-dimethyl-2-oxa-4,10-diazatricyclo[9.4.0.0^{3,8}]pentadeca-1(15),3,5,7,11,13-hexaen-9-one::Pyridobenzoxazepinone 68
SMILES CCN1c2cc(C)c(C)cc2Oc2ncc(N)cc2C1=O
InChI Key InChIKey=LQQHADUYCCSZCE-UHFFFAOYSA-N
Data  1 IC50
  Tab Delimited (TSV)   2D SDfile   Computed 3D by Vconf -m prep SDfile
Find this compound or compounds like it in BindingDB:
Activity Spreadsheet -- Enzyme Inhibition Constant Data from BindingDB
Found 1 hit for monomerid = 2000
TargetGag-Pol polyprotein [600-1027,R876K]/[600-1155](Human immunodeficiency virus type 1)
Boehringer Ingelheim Pharmaceuticals
LigandPNGBDBM2000(6-amino-10-ethyl-13,14-dimethyl-2-oxa-4,10-diazatr...)
Affinity DataIC50:  71nM. Assay description: The IC50 of reverse transcriptase is the concentration that inhibits 50% of recombinant HIV-1 RT RNA-directed DNA polymerase activity in vitro.
In DepthDetails ArticlePubMed