BDBM200672 US9233086, 4E
SMILES CC(C)[C@H](NC(=O)[C@H](CCCNC(N)=N)NC(=O)C(C)(C)NC(C)=O)C(N)=O
InChI Key InChIKey=UTPHYHSDOXAVFV-RYUDHWBXSA-N
Data  1 IC50
  Tab Delimited (TSV)   2D SDfile   Computed 3D by Vconf -m prep SDfile
Find this compound or compounds like it in BindingDB:
Activity Spreadsheet -- Enzyme Inhibition Constant Data from BindingDB
Found 1 hit for monomerid = 200672
TargetWD repeat-containing protein 5 [24-334](Homo sapiens (Human))
The Regents Of The University Of Michigan
US Patent
LigandPNGBDBM200672(US9233086, 4E)
Affinity DataIC50: <1.00E+3nMpH: 6.5 T: 2°C. Assay description: N-terminal His-tagged WDR5Δ23 (residues 24-334) was expressed from the pET28-MHL vector in Rosetta2(DE3) pLysS cells (Novagen). Cells were grown...
Ligand InfoPC cidPC sid
In DepthDetails US Patent