BDBM201013 US9540373, 2::US9879026, Example 2::USRE47636, Example 2
SMILES Fc1cc(ccc1C[C@H](NC(=O)[C@H]1N[C@@H]2CC[C@H]1C2)C#N)-c1ccc2CCC3(CCNCC3)c2c1
InChI Key InChIKey=DSRUXRRIDSZAIA-LAOBSVPGSA-N
Data  3 IC50
  Tab Delimited (TSV)   2D SDfile   Computed 3D by Vconf -m prep SDfile
Find this compound or compounds like it in BindingDB:
Activity Spreadsheet -- Enzyme Inhibition Constant Data from BindingDB
Found 3 hits for monomerid = 201013
TargetDipeptidyl peptidase 1(Homo sapiens (Human))
Boehringer Ingelheim International
US Patent
LigandPNGBDBM201013(US9540373, 2 | US9879026, Example 2 | USRE47636, E...)
Affinity DataIC50:  0.600nMT: 2°C. Assay description: The recombinant human DPPI was diluted in TAGZyme buffer to 1 U/ml (38.1 μg/ml, respectively), and then activated by mixing in a 1:2 ratio with ...
Ligand InfoPC cidPC sid
In DepthDetails US Patent
TargetDipeptidyl peptidase 1(Homo sapiens (Human))
Boehringer Ingelheim International
US Patent
LigandPNGBDBM201013(US9540373, 2 | US9879026, Example 2 | USRE47636, E...)
Affinity DataIC50:  0.600nM. Assay description: Materials: Microtiterplates (Optiplate-384 F) were purchased from PerkinElmer (Prod. No. 10 6007270). The substrate Gly-Arg-AMC was from Biotrend (Pr...
Ligand InfoPC cidPC sid
In DepthDetails US Patent
TargetDipeptidyl peptidase 1(Homo sapiens (Human))
Boehringer Ingelheim International
US Patent
LigandPNGBDBM201013(US9540373, 2 | US9879026, Example 2 | USRE47636, E...)
Affinity DataIC50:  0.600nMT: 2°C. Assay description: Assay conditions: The recombinant human DPPI was diluted in TAGZyme buffer to 1 U/ml (38.1 μg/ml, respectively), and then activated by mixing in...
Ligand InfoPC cidPC sid
In DepthDetails US Patent