BDBM201129 US9233953, 90
SMILES Fc1ccc(s1)C1CN(CCN1C(=O)C1CCS(=O)(=O)CC1)c1nnc(o1)C(F)(F)F
InChI Key InChIKey=NLPAJKFEIXHGQP-UHFFFAOYSA-N
Data  1 IC50
  Tab Delimited (TSV)   2D SDfile   Computed 3D by Vconf -m prep SDfile
Find this compound or compounds like it in BindingDB:
Activity Spreadsheet -- Enzyme Inhibition Constant Data from BindingDB
Found 1 hit for monomerid = 201129
TargetSodium- and chloride-dependent glycine transporter 1(Homo sapiens (Human))
Boehringer Ingelheim International
US Patent
LigandPNGBDBM201129(US9233953, 90)
Affinity DataIC50:  30nM. Assay description: Cells expressing either endogenously the GlyT1 transporter like JAR cells (human placental choriocarcinoma cells; e.g. WO 2008/002583) or SK-N-MC cel...
Ligand InfoPC cidPC sid
In DepthDetails US Patent