BDBM20147 5-(3,4-dichlorophenyl)-2-(2,3-dimethoxyphenyl)-3-[(2,4,6-trifluorophenyl)carbonyl]-2,3-dihydro-1,3,4-thiadiazole::N-Acylthiadiazoline, 7
SMILES COc1cccc(C2SC(=NN2C(=O)c2c(F)cc(F)cc2F)c2ccc(Cl)c(Cl)c2)c1OC
InChI Key InChIKey=ISPXLKSACDLINS-UHFFFAOYSA-N
Data  1 EC50
  Tab Delimited (TSV)   2D SDfile   Computed 3D by Vconf -m prep SDfile
Find this compound or compounds like it in BindingDB:
Activity Spreadsheet -- Enzyme Inhibition Constant Data from BindingDB
Found 1 hit for monomerid = 20147
TargetOxysterols receptor LXR-beta(Homo sapiens (Human))
Gnf
LigandPNGBDBM20147(5-(3,4-dichlorophenyl)-2-(2,3-dimethoxyphenyl)-3-[...)
Affinity DataEC50: >1.00E+4nMpH: 7.2 T: 2°C. Assay description: FRET-based co-activator recruitment assay measures agonist activities in a 384-well plate format. Reaction mixture containing His-tagged hLXR, biotin...
In DepthDetails ArticlePubMed