BDBM201634 US9233979, 62
SMILES C[C@@H](NC(=O)Nc1cc2[nH]nc(Nc3ccnc(C)c3)c2cn1)c1ccccc1
InChI Key
Data  1 IC50
  Tab Delimited (TSV)   2D SDfile   Computed 3D by Vconf -m prep SDfile
Find this compound or compounds like it in BindingDB:
Activity Spreadsheet -- Enzyme Inhibition Constant Data from BindingDB
Found 1 hit for monomerid = 201634
TargetMitogen-activated protein kinase 1(Homo sapiens (Human))
Merck Sharp & Dohme
US Patent
LigandPNGBDBM201634(US9233979, 62)
Affinity DataIC50:  14.7nM. Assay description: Activated ERK2 activity was determined in an IMAP-FP assay (Molecular Devices). Using this assay format, the potency (IC50) of each compound was de...
Ligand InfoPC cidPC sid
In DepthDetails US Patent