BDBM201720 US9233979, 151
SMILES CCNc1n[nH]c2cc(NC(=O)N[C@@H]([C@@H]3CCCO3)c3ccccc3)ncc12
InChI Key
Data  1 IC50
  Tab Delimited (TSV)   2D SDfile   Computed 3D by Vconf -m prep SDfile
Find this compound or compounds like it in BindingDB:
Activity Spreadsheet -- Enzyme Inhibition Constant Data from BindingDB
Found 1 hit for monomerid = 201720
TargetMitogen-activated protein kinase 1(Homo sapiens (Human))
Merck Sharp & Dohme
US Patent
LigandPNGBDBM201720(US9233979, 151)
Affinity DataIC50:  315nM. Assay description: Activated ERK2 activity was determined in an IMAP-FP assay (Molecular Devices). Using this assay format, the potency (IC50) of each compound was de...
Ligand InfoPC cidPC sid
In DepthDetails US Patent