BDBM201966 US9233979, 398
SMILES CC(C)OC(=O)Nc1n[nH]c2cc(NC(=O)N[C@H](C)c3ccc(F)cc3)ncc12
InChI Key
Data  1 IC50
  Tab Delimited (TSV)   2D SDfile   Computed 3D by Vconf -m prep SDfile
Find this compound or compounds like it in BindingDB:
Activity Spreadsheet -- Enzyme Inhibition Constant Data from BindingDB
Found 1 hit for monomerid = 201966
TargetMitogen-activated protein kinase 1(Homo sapiens (Human))
Merck Sharp & Dohme
US Patent
LigandPNGBDBM201966(US9233979, 398)
Affinity DataIC50:  52.5nM. Assay description: Activated ERK2 activity was determined in an IMAP-FP assay (Molecular Devices). Using this assay format, the potency (IC50) of each compound was de...
Ligand InfoPC cidPC sid
In DepthDetails US Patent