BDBM202324 US9238619, 54
SMILES Cn1cnc(c1)S(=O)(=O)NCCOc1cccc(c1)C1(Cc2ccccc2)CN(CC(F)(F)F)C1
InChI Key InChIKey=YCWLCZRTIDHAIQ-UHFFFAOYSA-N
Data  1 KI
  Tab Delimited (TSV)   2D SDfile   Computed 3D by Vconf -m prep SDfile
Find this compound or compounds like it in BindingDB:
Activity Spreadsheet -- Enzyme Inhibition Constant Data from BindingDB
Found 1 hit for monomerid = 202324
TargetSodium- and chloride-dependent glycine transporter 1(Homo sapiens (Human))
Abbvie Deutschland
US Patent
LigandPNGBDBM202324(US9238619, 54)
Affinity DataKi: <1nM. Assay description: Radioligand binding to human GlyT1c transporter-expressing membranes was determined as described in Mezler et al., Molecular Pharmacology 74:1705-171...
Ligand InfoPC cidPC sid
In DepthDetails US Patent