BDBM202608 US9539260, A30::US9763952, Example A30
SMILES CCC(=O)N1CC[C@@H](C1)Oc1ccc2OCCN(c3cncc(c3)S(=O)(=O)N(C)OC)c2c1
InChI Key InChIKey=RVFMUGPKZSRMSW-SFHVURJKSA-N
Data  4 IC50
  Tab Delimited (TSV)   2D SDfile   Computed 3D by Vconf -m prep SDfile
Find this compound or compounds like it in BindingDB:
Activity Spreadsheet -- Enzyme Inhibition Constant Data from BindingDB
Found 4 hits for monomerid = 202608
LigandPNGBDBM202608(US9539260, A30 | US9763952, Example A30)
Affinity DataIC50:  260nMT: 2°C. Assay description: Determination of Enzymatic PI3K Alpha and PI3K Delta Isoform Inhibition1.1 Test of Lipid Kinase ActivityThe efficacy of the compounds of examples 1-1...
Ligand InfoPC cidPC sid
In DepthDetails US Patent
LigandPNGBDBM202608(US9539260, A30 | US9763952, Example A30)
Affinity DataIC50:  31nM
Ligand InfoPC cidPC sid
In DepthDetails US Patent
LigandPNGBDBM202608(US9539260, A30 | US9763952, Example A30)
Affinity DataIC50:  260nM. Assay description: The kinase reaction is performed in a final volume of 50 μl per well of a half area COSTAR, 96 well plate. The final concentrations of ATP and p...
Ligand InfoPC cidPC sid
In DepthDetails US Patent
LigandPNGBDBM202608(US9539260, A30 | US9763952, Example A30)
Affinity DataIC50:  31nMT: 2°C. Assay description: Determination of Enzymatic PI3K Alpha and PI3K Delta Isoform Inhibition1.1 Test of Lipid Kinase ActivityThe efficacy of the compounds of examples 1-1...
Ligand InfoPC cidPC sid
In DepthDetails US Patent