BDBM20271 (4S)-4-{[(1S,2S)-1-{[(1S)-1-carbamoyl-2-methylpropyl]carbamoyl}-2-hydroxypropyl]carbamoyl}-4-{[(2S)-1-[(2S)-2-[(2S)-2-acetamido-3-[4-(phosphonooxy)phenyl]propanamido]-4-methylpentanoyl]pyrrolidin-2-yl]formamido}butanoic acid::Y(p)LPETV::gp130 (904) derived peptide, 29
SMILES CC(C)C[C@H](NC(=O)[C@H](Cc1ccc(OP(O)(O)=O)cc1)NC(C)=O)C(=O)N1CCC[C@H]1C(=O)N[C@@H](CCC(O)=O)C(=O)N[C@@H](C(C)O)C(=O)N[C@@H](C(C)C)C(N)=O
InChI Key InChIKey=RHSQSBUWCSRWKA-GUPZZSRQSA-N
Data  1 IC50
  Tab Delimited (TSV)   2D SDfile   Computed 3D by Vconf -m prep SDfile
Find this compound or compounds like it in BindingDB:
Activity Spreadsheet -- Enzyme Inhibition Constant Data from BindingDB
Found 1 hit for monomerid = 20271
TargetSignal transducer and activator of transcription 3(Mus musculus (mouse))
The University Of Texas At Houston
LigandPNGBDBM20271((4S)-4-{[(1S,2S)-1-{[(1S)-1-carbamoyl-2-methylprop...)
Affinity DataIC50: >6.00E+3nMpH: 7.8 T: 2°C. Assay description: His10-Stat3 was expressed in Sf9 cells from a baculovirus encoding the recombinant protein. A nuclear extract of the Sf9 cells was incubated with 32P...
In DepthDetails ArticlePubMed