BDBM203283 US10227340, Example 3::US9242975, 3
SMILES CC(C)Nc1cc(Nc2ccc3nsnc3c2)ncc1-c1nnc(s1)C(=O)N1CC[C@@H](O)C1
InChI Key InChIKey=JSADXPHJQCCHLN-CYBMUJFWSA-N
Data  2 IC50
  Tab Delimited (TSV)   2D SDfile   Computed 3D by Vconf -m prep SDfile
Find this compound or compounds like it in BindingDB:
Activity Spreadsheet -- Enzyme Inhibition Constant Data from BindingDB
Found 2 hits for monomerid = 203283
TargetInterleukin-1 receptor-associated kinase 4(Homo sapiens (Human))
Bristol-Myers Squibb
US Patent
LigandPNGBDBM203283(US10227340, Example 3 | US9242975, 3)
Affinity DataIC50:  2.5nM. Assay description: The assays were performed in U-bottom 384-well plates. The final assay volume was 30 μL prepared from 15 μL additions of enzyme and substra...
Ligand InfoPC cidPC sid
In DepthDetails US Patent
TargetInterleukin-1 receptor-associated kinase 4(Homo sapiens (Human))
Bristol-Myers Squibb
US Patent
LigandPNGBDBM203283(US10227340, Example 3 | US9242975, 3)
Affinity DataIC50:  2.5nMpH: 7.2 T: 2°C. Assay description: The assays were performed in U-bottom 384-well plates. The final assay volume was 30 μL prepared from 15 μL additions of enzyme and substrates...
Ligand InfoPC cidPC sid
In DepthDetails US Patent