BDBM203302 US10227340, Example 143::US9242975, 143
SMILES CC(C)Nc1cc(Nc2ccc3ncsc3c2)ncc1-c1nnc(o1)-c1ccc(F)c(c1)S(=O)(=O)NC(C)(C)C
InChI Key InChIKey=HQVPIXYBXXGIGM-UHFFFAOYSA-N
Data  2 IC50
  Tab Delimited (TSV)   2D SDfile   Computed 3D by Vconf -m prep SDfile
Find this compound or compounds like it in BindingDB:
Activity Spreadsheet -- Enzyme Inhibition Constant Data from BindingDB
Found 2 hits for monomerid = 203302
TargetInterleukin-1 receptor-associated kinase 4(Homo sapiens (Human))
Bristol-Myers Squibb
US Patent
LigandPNGBDBM203302(US10227340, Example 143 | US9242975, 143)
Affinity DataIC50:  676nM. Assay description: The assays were performed in U-bottom 384-well plates. The final assay volume was 30 μL prepared from 15 μL additions of enzyme and substra...
Ligand InfoPC cidPC sid
In DepthDetails US Patent
TargetInterleukin-1 receptor-associated kinase 4(Homo sapiens (Human))
Bristol-Myers Squibb
US Patent
LigandPNGBDBM203302(US10227340, Example 143 | US9242975, 143)
Affinity DataIC50:  676nMpH: 7.2 T: 2°C. Assay description: The assays were performed in U-bottom 384-well plates. The final assay volume was 30 μL prepared from 15 μL additions of enzyme and substrates...
Ligand InfoPC cidPC sid
In DepthDetails US Patent