BDBM203532 US9221809, 89
SMILES O=C1CC[C@H](CN1)Nc1nc([nH]c(=O)c1-c1nc2ccccc2s1)N1CCOCC1
InChI Key
Data  2 IC50
  Tab Delimited (TSV)   2D SDfile   Computed 3D by Vconf -m prep SDfile
Find this compound or compounds like it in BindingDB:
Activity Spreadsheet -- Enzyme Inhibition Constant Data from BindingDB
Found 2 hits for monomerid = 203532
TargetInterleukin-1 receptor-associated kinase 4(Homo sapiens (Human))
Merck Research Laboratories
Curated by ChEMBL
LigandPNGBDBM203532(US9221809, 89)
Affinity DataIC50:  450nM. Assay description: Inhibition of IRAK4 (unknown origin) using 5FAM-RKRQGSVRRRVHCCOOH as substrate after 30 mins by IMAP assay
Ligand InfoPC cidPC sid
In DepthDetails ArticlePubMed
TargetInterleukin-1 receptor-associated kinase 4(Homo sapiens (Human))
Merck Research Laboratories
Curated by ChEMBL
LigandPNGBDBM203532(US9221809, 89)
Affinity DataIC50:  450nMpH: 7.2 T: 2°C. Assay description: A 20 ul reaction mixture contains 10 mM TriHCl, pH 7.2, 0.5 nM GST tagged IRAK4 (SignalChem), 100 nM fluorescent peptide substrate (RP7030, Molecul...
Ligand InfoPC cidPC sid
In DepthDetails US Patent