BDBM203602 US9221809, 160
SMILES Cc1cnc(C)c(n1)N1CCN(CC1)c1nc(N[C@@H]2CCCNC2)c(-c2nc3ccccc3s2)c(=O)[nH]1
InChI Key
Data  1 IC50
  Tab Delimited (TSV)   2D SDfile   Computed 3D by Vconf -m prep SDfile
Find this compound or compounds like it in BindingDB:
Activity Spreadsheet -- Enzyme Inhibition Constant Data from BindingDB
Found 1 hit for monomerid = 203602
TargetInterleukin-1 receptor-associated kinase 4(Homo sapiens (Human))
Merck Sharp & Dohme
US Patent
LigandPNGBDBM203602(US9221809, 160)
Affinity DataIC50:  22nMpH: 7.2 T: 2°C. Assay description: A 20 ul reaction mixture contains 10 mM TriHCl, pH 7.2, 0.5 nM GST tagged IRAK4 (SignalChem), 100 nM fluorescent peptide substrate (RP7030, Molecul...
Ligand InfoPC cidPC sid
In DepthDetails US Patent