BDBM203788 US9221809, 339
SMILES Clc1cccc2nc(sc12)-c1c(N[C@@H]2CCCNC2)nc([nH]c1=O)N1CCOCC1
InChI Key
Data  1 IC50
  Tab Delimited (TSV)   2D SDfile   Computed 3D by Vconf -m prep SDfile
Find this compound or compounds like it in BindingDB:
Activity Spreadsheet -- Enzyme Inhibition Constant Data from BindingDB
Found 1 hit for monomerid = 203788
TargetInterleukin-1 receptor-associated kinase 4(Homo sapiens (Human))
Merck Sharp & Dohme
US Patent
LigandPNGBDBM203788(US9221809, 339)
Affinity DataIC50:  180nMpH: 7.2 T: 2°C. Assay description: A 20 ul reaction mixture contains 10 mM TriHCl, pH 7.2, 0.5 nM GST tagged IRAK4 (SignalChem), 100 nM fluorescent peptide substrate (RP7030, Molecul...
Ligand InfoPC cidPC sid
In DepthDetails US Patent