BDBM203883 US9242973, RP95
SMILES NC1=NC2(CO1)c1cc(ccc1OC(CCC(F)(F)F)C21COC1)-c1cncnc1
InChI Key InChIKey=SIJQFJDBAGZTQE-UHFFFAOYSA-N
Data  3 IC50
  Tab Delimited (TSV)   2D SDfile   Computed 3D by Vconf -m prep SDfile
Find this compound or compounds like it in BindingDB:
Activity Spreadsheet -- Enzyme Inhibition Constant Data from BindingDB
Found 3 hits for monomerid = 203883
TargetBeta-secretase 1(Homo sapiens (Human))
Comentis
US Patent
LigandPNGBDBM203883(US9242973, RP95)
Affinity DataIC50:  740nMpH: 4.4 T: 2°C. Assay description: Test Example 1: Potency of test compounds were determined by measurement of their inhibition of BACE1 activity toward a fluorescent substrate. Experi...
Ligand InfoPC cidPC sid
In DepthDetails US Patent
TargetPotassium voltage-gated channel subfamily H member 2(Homo sapiens (Human))
Comentis
US Patent
LigandPNGBDBM203883(US9242973, RP95)
Affinity DataIC50: >1.00E+4nM. Assay description: Test Example 5: The hERG potassium current was measured in a hERG-stably-expressing Chinese hamster ovary K1 (CHO) cells. The experiments were perfor...
Ligand InfoPC cidPC sid
In DepthDetails US Patent
TargetBeta-secretase 1(Homo sapiens (Human))
Comentis
US Patent
LigandPNGBDBM203883(US9242973, RP95)
Affinity DataIC50:  410nMT: 2°C. Assay description: Test Example 3: The potency of compounds against BACE1 activity was determined in a cellular assay of Aβ production. Human SK-N-BE(2) neuroblas...
Ligand InfoPC cidPC sid
In DepthDetails US Patent