BDBM204049 US9242996, 171
SMILES COCCn1cc(cn1)-c1cnc(N)c(c1)-c1ccc(C(=O)N[C@H](CO)c2ccccc2)c(F)c1
InChI Key InChIKey=VALPWMMHOXNWLY-XMMPIXPASA-N
Data  1 IC50
  Tab Delimited (TSV)   2D SDfile   Computed 3D by Vconf -m prep SDfile
Find this compound or compounds like it in BindingDB:
Activity Spreadsheet -- Enzyme Inhibition Constant Data from BindingDB
Found 1 hit for monomerid = 204049
TargetMitogen-activated protein kinase 1(Homo sapiens (Human))
Novartis
US Patent
LigandPNGBDBM204049(US9242996, 171)
Affinity DataIC50:  1.09nMpH: 7.5Assay Description:Compound potency against activated ERK2 was determined using a kinase assay that measures ERK2-catalyzed phosphorylation of biotinylated ERKtide pept...
Ligand InfoPC cidPC sid
In DepthDetails US Patent