BDBM204384 US9242996, 463
SMILES Nc1ncc(nc1-c1ccc(C(=O)N[C@H](CO)c2cc(F)cc(I)c2)c(F)c1)[C@H]1CC[C@H](O)[C@@H](O)C1
InChI Key InChIKey=KKDVTIQSRCNFLZ-VIWXFRHCSA-N
Data  1 IC50
  Tab Delimited (TSV)   2D SDfile   Computed 3D by Vconf -m prep SDfile
Find this compound or compounds like it in BindingDB:
Activity Spreadsheet -- Enzyme Inhibition Constant Data from BindingDB
Found 1 hit for monomerid = 204384
TargetMitogen-activated protein kinase 1(Homo sapiens (Human))
Novartis
US Patent
LigandPNGBDBM204384(US9242996, 463)
Affinity DataIC50:  0.00550nMpH: 7.5Assay Description:Compound potency against activated ERK2 was determined using a kinase assay that measures ERK2-catalyzed phosphorylation of biotinylated ERKtide pept...
Ligand InfoPC cidPC sid
In DepthDetails US Patent