BDBM204634 US9243002, 34
SMILES CNC(=O)c1c(oc2cc(N(C)S(C)(=O)=O)c(cc12)-c1ccc2CCn3c(cc4c(F)cccc34)-c2n1)-n1ccccc1=O
InChI Key InChIKey=XANBGUHXQSOBDE-UHFFFAOYSA-N
Data  2 IC50
  Tab Delimited (TSV)   2D SDfile   Computed 3D by Vconf -m prep SDfile
Find this compound or compounds like it in BindingDB:
Activity Spreadsheet -- Enzyme Inhibition Constant Data from BindingDB
Found 2 hits for monomerid = 204634
TargetGenome polyprotein(Hepatitis C Virus (Virus))
Merck Sharp & Dohme
US Patent
LigandPNGBDBM204634(US9243002, 34)
Affinity DataIC50:  4.66nM. Assay description: To initiate an assay, replicon cells were plated in the presence of a dilution series of test compound in the absence of G418. Typically, the assays ...
Ligand InfoPC cidPC sid
In DepthDetails US Patent
TargetGenome polyprotein(Hepatitis C virus (HCV genotype 1a, isolate H))
Merck Sharp & Dohme
US Patent
LigandPNGBDBM204634(US9243002, 34)
Affinity DataIC50:  5.38nM. Assay description: To initiate an assay, replicon cells were plated in the presence of a dilution series of test compound in the absence of G418. Typically, the assays ...
Ligand InfoPC cidPC sid
In DepthDetails US Patent